Reaction Details
TargetAdenosine deaminase
LigandBDBM50031255
Substrate/Competitorn/a
Meas. Tech.ChEMBL_30794 (CHEMBL645070)
Ki 87000±n/a nM
Citation Cristalli, GVittori, SEleuteri, AVolpini, RCamaioni, ELupidi, GMahmood, NBevilacqua, FPalù, G Synthesis and biological evaluation of N6-cycloalkyl derivatives of 1-deazaadenine nucleosides: a new class of anti-human immunodeficiency virus agents. J Med Chem38:4019-25 (1995) Adenosine deaminase
Name:Adenosine deaminase
Type:Enzyme
Mol. Mass.:40910.44
Organism:Bos taurus (bovine)
Description:n/a
Residue:363
BDBM50031255
NameBDBM50031255
Synonyms:5-(7-Cyclohexylamino-imidazo[4,5-b]pyridin-3-yl)-2-hydroxymethyl-tetrahydro-furan-3-ol | CHEMBL336307
TypeSmall organic molecule
Emp. Form.C17H24N4O3
Mol. Mass.332.3975
SMILESOCC1OC(CC1O)n1cnc2c(NC3CCCCC3)ccnc12