Reaction Details
Target5-hydroxytryptamine receptor 1A
LigandBDBM50029245
Substrate/Competitorn/a
Meas. Tech.ChEMBL_1143 (CHEMBL616088)
Ki 2.3±n/a nM
Citation Scott, MKBaxter, EWBennett, DJBoyd, REBlum, PSCodd, EEKukla, MJMalloy, EMaryanoff, BEMaryanoff, CA Piperazinylalkyl heterocycles as potential antipsychotic agents. J Med Chem38:4198-210 (1995) 5-hydroxytryptamine receptor 1A
Name:5-hydroxytryptamine receptor 1A
Type:G Protein-Coupled Receptor (GPCR)
Mol. Mass.:46445.29
Organism:Rattus norvegicus (rat)
Description:Binding assays were performed using rat hippocampal membranes.
Residue:422
BDBM50029245
NameBDBM50029245
Synonyms:1-(5-{2-[4-(2-Isopropoxy-phenyl)-piperazin-1-yl]-ethyl}-1-methyl-1H-pyrrol-2-yl)-2-piperidin-1-yl-ethane-1,2-dione;succinate
TypeSmall organic molecule
Emp. Form.C27H38N4O3
Mol. Mass.466.6156
SMILESCC(C)Oc1ccccc1N1CCN(CCc2ccc(C(=O)C(=O)N3CCCCC3)n2C)CC1