Reaction Details
TargetD(2) dopamine receptor
LigandBDBM50029277
Substrate/Competitorn/a
Meas. Tech.ChEMBL_62394 (CHEMBL672949)
Ki 100±n/a nM
Citation Scott, MKBaxter, EWBennett, DJBoyd, REBlum, PSCodd, EEKukla, MJMalloy, EMaryanoff, BEMaryanoff, CA Piperazinylalkyl heterocycles as potential antipsychotic agents. J Med Chem38:4198-210 (1995) D(2) dopamine receptor
Name:D(2) dopamine receptor
Type:G Protein-Coupled Receptor (GPCR)
Mol. Mass.:50931.60
Organism:Rattus norvegicus (rat)
Description:P61169
Residue:444
BDBM50029277
NameBDBM50029277
Synonyms:N-{5-[4-(2-Isopropoxy-phenyl)-piperazin-1-ylmethyl]-1-methyl-1H-pyrrol-2-ylmethyl}-N-methyl-isobutyramide;succinate
TypeSmall organic molecule
Emp. Form.C25H38N4O2
Mol. Mass.426.5948
SMILESCC(C)Oc1ccccc1N1CCN(Cc2ccc(CN(C)C(=O)C(C)C)n2C)CC1