Reaction Details
TargetProgesterone receptor
LigandBDBM8903
Substrate/Competitorn/a
Meas. Tech.ChEMBL_159371 (CHEMBL768145)
IC50 17±n/a nM
Citation Combs, DWReese, KCornelius, LAGunnet, JWCryan, EVGranger, KSJordan, JJDemarest, KT Nonsteroidal progesterone receptor ligands. 2. High-affinity ligands with selectivity for bone cell progesterone receptors. J Med Chem38:4880-4 (1996) Progesterone receptor
Name:Progesterone receptor
Type:Protein
Mol. Mass.:98979.52
Organism:Homo sapiens (Human)
Description:P06401
Residue:933
BDBM8903
NameBDBM8903
Synonyms:(1S,2R,10S,11S,14S,15S)-14-acetyl-2,15-dimethyltetracyclo[8.7.0.0^{2,7}.0^{11,15}]heptadec-6-en-5-one progesterone
TypeSteroid
Emp. Form.C21H30O2
Mol. Mass.314.4617
SMILES[H][C@@]12CC[C@H](C(C)=O)[C@@]1(C)CC[C@@]1([H])[C@@]2([H])CCC2=CC(=O)CC[C@]12C