Reaction Details
TargetL-selectin
LigandBDBM50422131
Substrate/Competitorn/a
Meas. Tech.ChEMBL_200001 (CHEMBL810690)
IC50 1000000±n/a nM
Citation Kogan, TPDupré, BKeller, KMScott, ILBui, HMarket, RVBeck, PJVoytus, JARevelle, BMScott, D Rational design and synthesis of small molecule, non-oligosaccharide selectin inhibitors: (alpha-D-mannopyranosyloxy)biphenyl-substituted carboxylic acids. J Med Chem38:4976-84 (1996) L-selectin
Name:L-selectin
Type:PROTEIN
Mol. Mass.:42288.63
Organism:Mus musculus
Description:ChEMBL_199996
Residue:372
BDBM50422131
NameBDBM50422131
Synonyms:CHEMBL2303887
TypeSmall organic molecule
Emp. Form.C20H22O8
Mol. Mass.390.3839
SMILESOC[C@H]1O[C@H](Oc2ccccc2-c2cccc(CC(O)=O)c2)[C@@H](O)[C@H](O)[C@@H]1O