Reaction Details
TargetMu-type opioid receptor
LigandBDBM50036136
Substrate/Competitorn/a
Meas. Tech.ChEMBL_145429 (CHEMBL748774)
Ki 219±n/a nM
Citation Portoghese, PSFarouz-Grant, FSultana, MTakemori, AE 7'-Substituted amino acid conjugates of naltrindole. Hydrophilic groups as determinants of selective antagonism of delta 1 opioid receptor-mediated antinociception in mice. J Med Chem38:402-7 (1995) Mu-type opioid receptor
Name:Mu-type opioid receptor
Type:Enzyme Catalytic Domain
Mol. Mass.:11165.58
Organism:GUINEA PIG
Description:P97266
Residue:98
BDBM50036136
NameBDBM50036136
Synonyms:6-amino-2-[22-cyclopropylmethyl-2,16-dihydroxy-(2S,13R)-14-oxa-11,22-diazaheptacyclo[13.9.1.01,13.02,21.04,12.05,10.019,25]pentacosa-4(12),5(10),6,8,15(25),16,18-heptaen-9-ylcarboxamido]-(2R)-hexanoic acid | CHEMBL335936
TypeSmall organic molecule
Emp. Form.C33H38N4O6
Mol. Mass.586.678
SMILESNCCCC[C@@H](NC(=O)c1cccc2c3C[C@@]4(O)C5Cc6ccc(O)c7O[C@@H](c3[nH]c12)C4(CCN5CC1CC1)c67)C(O)=O