Reaction Details
TargetDelta-type opioid receptor
LigandBDBM50036137
Substrate/Competitorn/a
Meas. Tech.ChEMBL_145075 (CHEMBL754635)
Ki 0.410000±n/a nM
Citation Portoghese, PSFarouz-Grant, FSultana, MTakemori, AE 7'-Substituted amino acid conjugates of naltrindole. Hydrophilic groups as determinants of selective antagonism of delta 1 opioid receptor-mediated antinociception in mice. J Med Chem38:402-7 (1995) Delta-type opioid receptor
Name:Delta-type opioid receptor
Type:G Protein-Coupled Receptor (GPCR)
Mol. Mass.:40382.98
Organism:Homo sapiens (Human)
Description:Competition binding assays were carried out using membrane preparations from transfected HN9.10 cells that constitutively expressed the delta opioid receptor.
Residue:372
BDBM50036137
NameBDBM50036137
Synonyms:2-[22-cyclopropylmethyl-2,16-dihydroxy-(2S,13R)-14-oxa-11,22-diazaheptacyclo[13.9.1.01,13.02,21.04,12.05,10.019,25]pentacosa-4(12),5(10),6,8,15(25),16,18-heptaen-9-ylcarboxamido]-(2R)-butanedioic acid | CHEMBL334970
TypeSmall organic molecule
Emp. Form.C31H31N3O8
Mol. Mass.573.5931
SMILESOC(=O)C[C@@H](NC(=O)c1cccc2c3C[C@@]4(O)C5Cc6ccc(O)c7O[C@@H](c3[nH]c12)C4(CCN5CC1CC1)c67)C(O)=O