Reaction Details
TargetDihydrofolate reductase
LigandBDBM50036495
Substrate/Competitorn/a
Meas. Tech.ChEMBL_216590 (CHEMBL821382)
Ki 0.540000±n/a nM
Citation Rosowsky, AMota, CEQueener, SFWaltham, MErcikan-Abali, EBertino, JR 2,4-Diamino-5-substituted-quinazolines as inhibitors of a human dihydrofolate reductase with a site-directed mutation at position 22 and of the dihydrofolate reductases from Pneumocystis carinii and Toxoplasma gondii. J Med Chem38:745-52 (1995) Dihydrofolate reductase
Name:Dihydrofolate reductase
Type:Enzyme
Mol. Mass.:21453.99
Organism:Homo sapiens (Human)
Description:Recombinant human DHFR.
Residue:187
BDBM50036495
NameBDBM50036495
Synonyms:2-{4-[(2,4-Diamino-quinazolin-5-ylmethyl)-amino]-benzoylamino}-pentanedioic acid | CHEMBL162476
TypeSmall organic molecule
Emp. Form.C21H22N6O5
Mol. Mass.438.4366
SMILESNc1nc(N)c2c(CNc3ccc(cc3)C(=O)NC(CCC(O)=O)C(O)=O)cccc2n1