Reaction Details
TargetAlpha-2A adrenergic receptor [16-465]
LigandBDBM50034043
Substrate/Competitorn/a
Meas. Tech.ChEMBL_33444 (CHEMBL649609)
IC50 0.40±n/a nM
Citation Strupczewski, JTBordeau, KJChiang, YGlamkowski, EJConway, PGCorbett, RHartman, HBSzewczak, MRWilmot, CAHelsley, GC 3-[[(Aryloxy)alkyl]piperidinyl]-1,2-benzisoxazoles as D2/5-HT2 antagonists with potential atypical antipsychotic activity: antipsychotic profile of iloperidone (HP 873). J Med Chem38:1119-31 (1995) Alpha-2A adrenergic receptor [16-465]
Name:Alpha-2A adrenergic receptor [16-465]
Type:G-protein coupled receptor
Mol. Mass.:48961.69
Organism:Rattus norvegicus (rat)
Description:P22909[16-465]
Residue:450
BDBM50034043
NameBDBM50034043
Synonyms:1-(4-{3-[4-(6-Fluoro-benzo[d]isoxazol-3-yl)-piperidin-1-yl]-propoxy}-3-methoxy-phenyl)-ethanone ILOPERIDONE
TypeSmall organic molecule
Emp. Form.C24H27FN2O4
Mol. Mass.426.4806
SMILESCOc1cc(ccc1OCCCN1CCC(CC1)c1noc2cc(F)ccc12)C(C)=O