Reaction Details
Target3-oxo-5-alpha-steroid 4-dehydrogenase 1
LigandBDBM50034159
Substrate/Competitorn/a
Meas. Tech.ChEMBL_204753 (CHEMBL805444)
IC50 3.3±n/a nM
Citation Li, XSingh, SMLabrie, F Synthesis and in vitro activity of 17 beta-(N-alkyl/arylformamido)- and 17 beta-[(N-alkyl/aryl)alkyl/arylamido]-4-methyl-4-aza-3-oxo-5 alpha-androstan-3-ones as inhibitors of human 5 alpha-reductases and antagonists of the androgen receptor. J Med Chem38:1158-73 (1995) 3-oxo-5-alpha-steroid 4-dehydrogenase 1
Name:3-oxo-5-alpha-steroid 4-dehydrogenase 1
Type:Enzyme
Mol. Mass.:29472.80
Organism:Homo sapiens (Human)
Description:P18405
Residue:259
BDBM50034159
NameBDBM50034159
Synonyms:CHEMBL278490 | N-Pentyl-N-((4aR,6aS,7S,11aR)-1,4a,6a-trimethyl-2-oxo-hexadecahydro-indeno[5,4-f]quinolin-7-yl)-butyramide
TypeSmall organic molecule
Emp. Form.C28H48N2O2
Mol. Mass.444.6929
SMILESCCCCCN([C@H]1CCC2C3CC[C@H]4N(C)C(=O)CC[C@]4(C)C3CC[C@]12C)C(=O)CCC