Reaction Details
TargetAdenosine receptor A1
LigandBDBM68391
Substrate/Competitorn/a
Meas. Tech.ChEMBL_29014 (CHEMBL875796)
Ki 6±n/a nM
Citation Siddiqi, SMJacobson, KAEsker, JLOlah, MEJi, XDMelman, NTiwari, KNSecrist, JASchneller, SWCristalli, G Search for new purine- and ribose-modified adenosine analogues as selective agonists and antagonists at adenosine receptors. J Med Chem38:1174-88 (1995) Adenosine receptor A1
Name:Adenosine receptor A1
Type:Protein
Mol. Mass.:36704.13
Organism:Rattus norvegicus (rat)
Description:n/a
Residue:326
BDBM68391
NameBDBM68391
Synonyms:(2R,3S,4S,5R)-2-(6-amino-2-fluoro-9-purinyl)-5-(hydroxymethyl)oxolane-3,4-diol (2R,3S,4S,5R)-2-(6-amino-2-fluoropurin-9-yl)-5-(hydroxymethyl)oxolane-3,4-diol FLUDARABINE MLS000028687 cid_657237 | fludara
TypeSmall organic molecule
Emp. Form.C10H12FN5O4
Mol. Mass.285.2318
SMILESNc1nc(F)nc2n(cnc12)[C@@H]1O[C@H](CO)[C@@H](O)[C@@H]1O