Reaction Details
Target5-hydroxytryptamine receptor 2C
LigandBDBM50004327
Substrate/Competitorn/a
Meas. Tech.ChEMBL_2819 (CHEMBL617848)
Ki 830±n/a nM
Citation Ismaiel, AMArruda, KTeitler, MGlennon, RA Ketanserin analogues: the effect of structural modification on 5-HT2 serotonin receptor binding. J Med Chem38:1196-202 (1995) 5-hydroxytryptamine receptor 2C
Name:5-hydroxytryptamine receptor 2C
Type:Enzyme
Mol. Mass.:51935.10
Organism:Rattus norvegicus (Rat)
Description:P08909
Residue:460
BDBM50004327
NameBDBM50004327
Synonyms:(1-Phenethyl-piperidin-4-yl)-phenyl-methanol Glemanserin MDL-11939
TypeSmall organic molecule
Emp. Form.C20H25NO
Mol. Mass.295.4186
SMILESOC(C1CCN(CCc2ccccc2)CC1)c1ccccc1