Reaction Details
Target5-hydroxytryptamine receptor 1D
LigandBDBM50034366
Substrate/Competitorn/a
Meas. Tech.ChEMBL_2043 (CHEMBL616841)
Ki 127±n/a nM
Citation Sonesson, CBarf, TNilsson, JDijkstra, DCarlsson, ASvensson, KSmith, MWMartin, IJDuncan, JNKing, LJ Synthesis and evaluation of pharmacological and pharmacokinetic properties of monopropyl analogs of 5-, 7-, and 8-[[(trifluoromethyl)sulfonyl]oxy]-2-aminotetralins: central dopamine and serotonin receptor activity. J Med Chem38:1319-29 (1995) 5-hydroxytryptamine receptor 1D
Name:5-hydroxytryptamine receptor 1D
Type:G Protein-Coupled Receptor (GPCR)
Mol. Mass.:41920.63
Organism:Homo sapiens (Human)
Description:Receptor binding assays were performed using human clone stably expressed in CHO cells.
Residue:377
BDBM50034366
NameBDBM50034366
Synonyms:CHEMBL28437 | Trifluoro-methanesulfonic acid 7-dipropylamino-5,6,7,8-tetrahydro-naphthalen-1-yl ester
TypeSmall organic molecule
Emp. Form.C17H24F3NO3S
Mol. Mass.379.438
SMILESCCCN(CCC)C1CCc2cccc(OS(=O)(=O)C(F)(F)F)c2C1