Reaction Details
TargetAdenosine receptor A1
LigandBDBM50369104
Substrate/Competitorn/a
Meas. Tech.ChEMBL_28394 (CHEMBL636813)
EC50 306±n/a nM
Citation Cristalli, GCamaioni, EVittori, SVolpini, RBorea, PAConti, ADionisotti, SOngini, EMonopoli, A 2-Aralkynyl and 2-heteroalkynyl derivatives of adenosine-5'-N-ethyluronamide as selective A2a adenosine receptor agonists. J Med Chem38:1462-72 (1995) Adenosine receptor A1
Name:Adenosine receptor A1
Type:Protein
Mol. Mass.:36704.13
Organism:Rattus norvegicus (rat)
Description:n/a
Residue:326
BDBM50369104
NameBDBM50369104
Synonyms:CHEMBL604026
TypeSmall organic molecule
Emp. Form.C19H25N7O4S
Mol. Mass.447.511
SMILESCCNC(=O)[C@H]1OC([C@H](O)[C@@H]1O)n1cnc2c(N)nc(nc12)C#CCN1CCSCC1