Reaction Details
TargetGlutamate receptor ionotropic, NMDA 2C
LigandBDBM50368882
Substrate/Competitorn/a
Meas. Tech.ChEMBL_154702 (CHEMBL763538)
Ki 370±n/a nM
Citation Berardi, FColabufo, NAGiudice, GPerrone, RTortorella, VGovoni, SLucchi, L New sigma and 5-HT1A receptor ligands: omega-(tetralin-1-yl)-n-alkylamine derivatives. J Med Chem39:176-82 (1996) 
 
Glutamate receptor ionotropic, NMDA 2C
Name:Glutamate receptor ionotropic, NMDA 2C
Type:Protein
Mol. Mass.:135305.94
Organism:Rattus norvegicus (Rat)
Description:Q00961
Residue:1237
BDBM50368882
NameBDBM50368882
Synonyms:CHEMBL147585 SK-10047
TypeSmall organic molecule
Emp. Form.C16H21NO
Mol. Mass.243.344
SMILESCC1C2Cc3ccc(O)cc3C1CCN2CC=C