Reaction Details
TargetAdenosine deaminase
LigandBDBM50407749
Substrate/Competitorn/a
Meas. Tech.ChEMBL_30974 (CHEMBL646136)
Ki 0.002500±n/a nM
Citation Marrone, TJStraatsma, TPBriggs, JMWilson, DKQuiocho, FAMcCammon, JA Theoretical study of inhibition of adenosine deaminase by (8R)-coformycin and (8R)-deoxycoformycin. J Med Chem39:277-84 (1996) 
 
Adenosine deaminase
Name:Adenosine deaminase
Type:Enzyme
Mol. Mass.:40759.44
Organism:Homo sapiens (Human)
Description:Human recombinant ADA was expressed and purified from an ADA-deficient bacterial strain.
Residue:363
BDBM50407749
NameBDBM50407749
Synonyms:CHEMBL2112110
TypeSmall organic molecule
Emp. Form.C12H17N3O4
Mol. Mass.267.2811
SMILESOC[C@@H]1O[C@@H](C[C@H]1O)n1cnc2[C@H](O)CCC=Nc12