Reaction Details
TargetReverse transcriptase/RNaseH
LigandBDBM50036543
Substrate/Competitorn/a
Meas. Tech.ChEMBL_195535 (CHEMBL800982)
IC50 160±n/a nM
Citation Silverman, BDPlatt, DE Comparative molecular moment analysis (CoMMA): 3D-QSAR without molecular superposition. J Med Chem39:2129-40 (1996) 
 
Reverse transcriptase/RNaseH
Name:Reverse transcriptase/RNaseH
Type:PROTEIN
Mol. Mass.:65229.15
Organism:Human immunodeficiency virus 1
Description:ChEMBL_1473730
Residue:566
BDBM50036543
NameBDBM50036543
Synonyms:4-Chloro-6-methyl-7-(3-methyl-but-2-enyl)-6,7,8,9-tetrahydro-2H-2,7,9a-triaza-benzo[cd]azulen-1-one | CHEMBL307994
TypeSmall organic molecule
Emp. Form.C16H20ClN3O
Mol. Mass.305.802
SMILESCC1N(CC=C(C)C)CCn2c3c1cc(Cl)cc3[nH]c2=O