Reaction Details
TargetReverse transcriptase/RNaseH
LigandBDBM50036499
Substrate/Competitorn/a
Meas. Tech.ChEMBL_195535 (CHEMBL800982)
IC50 25800±n/a nM
Citation Silverman, BDPlatt, DE Comparative molecular moment analysis (CoMMA): 3D-QSAR without molecular superposition. J Med Chem39:2129-40 (1996) 
 
Reverse transcriptase/RNaseH
Name:Reverse transcriptase/RNaseH
Type:PROTEIN
Mol. Mass.:65229.15
Organism:Human immunodeficiency virus 1
Description:ChEMBL_1473730
Residue:566
BDBM50036499
NameBDBM50036499
Synonyms:6,9-Dimethyl-7-(3-methyl-but-2-enyl)-6,7,8,9-tetrahydro-2H-2,7,9a-triaza-benzo[cd]azulene-1-thione | CHEMBL305070
TypeSmall organic molecule
Emp. Form.C17H23N3S
Mol. Mass.301.45
SMILESCC1CN(CC=C(C)C)C(C)c2cccc3[nH]c(=S)n1c23