Reaction Details
TargetReverse transcriptase/RNaseH
LigandBDBM50050816
Substrate/Competitorn/a
Meas. Tech.ChEMBL_195535 (CHEMBL800982)
IC50 670±n/a nM
Citation Silverman, BDPlatt, DE Comparative molecular moment analysis (CoMMA): 3D-QSAR without molecular superposition. J Med Chem39:2129-40 (1996) 
 
Reverse transcriptase/RNaseH
Name:Reverse transcriptase/RNaseH
Type:PROTEIN
Mol. Mass.:65229.15
Organism:Human immunodeficiency virus 1
Description:ChEMBL_1473730
Residue:566
BDBM50050816
NameBDBM50050816
Synonyms:4-Chloro-9-methyl-7-(2-methyl-allyl)-6,7,8,9-tetrahydro-2H-2,7,9a-triaza-benzo[cd]azulene-1-thione | CHEMBL308222
TypeSmall organic molecule
Emp. Form.C15H18ClN3S
Mol. Mass.307.842
SMILESCC1CN(CC(C)=C)Cc2cc(Cl)cc3[nH]c(=S)n1c23