Reaction Details
TargetReverse transcriptase/RNaseH
LigandBDBM50010251
Substrate/Competitorn/a
Meas. Tech.ChEMBL_195535 (CHEMBL800982)
IC50 34700±n/a nM
Citation Silverman, BDPlatt, DE Comparative molecular moment analysis (CoMMA): 3D-QSAR without molecular superposition. J Med Chem39:2129-40 (1996) 
 
Reverse transcriptase/RNaseH
Name:Reverse transcriptase/RNaseH
Type:PROTEIN
Mol. Mass.:65229.15
Organism:Human immunodeficiency virus 1
Description:ChEMBL_1473730
Residue:566
BDBM50010251
NameBDBM50010251
Synonyms:(S-(+))-8-Methyl-7-(2-methyl-allyl)-6,7,8,9-tetrahydro-2H-2,7,9a-triaza-benzo[cd]azulen-1-one CHEMBL65801
TypeSmall organic molecule
Emp. Form.C15H19N3O
Mol. Mass.257.3309
SMILESCC1Cn2c3c(CN1CC(C)=C)cccc3[nH]c2=O