Reaction Details
TargetEndothelin receptor type B
LigandBDBM50051406
Substrate/Competitorn/a
Meas. Tech.ChEMBL_63533 (CHEMBL677446)
IC50 3.6±n/a nM
Citation Fukami, TYamakawa, TNiiyama, KKojima, HAmano, YKanda, FOzaki, SFukuroda, TIhara, MYano, MIshikawa, K Synthesis and structure-activity relationships of 2-substituted D-tryptophan-containing peptidic endothelin receptor antagonists: importance of the C-2 substituent of the D-tryptophan residue for endothelin A and B receptor subtype selectivity. J Med Chem39:2313-30 (1996) 
 
Endothelin receptor type B
Name:Endothelin receptor type B
Type:Enzyme Catalytic Domain
Mol. Mass.:49664.00
Organism:Homo sapiens (Human)
Description:ENDOTHELIN B EDNRB HUMAN::P24530
Residue:442
BDBM50051406
NameBDBM50051406
Synonyms:2-((R)-3-(2-Bromo-1H-indol-3-yl)-2-{2-[((2S,6R)-2,6-dimethyl-piperidine-1-carbonyl)-amino]-4-methyl-pentanoylamino}-propionylamino)-3-ethylsulfanyl-propionic acid | CHEMBL305524
TypeSmall organic molecule
Emp. Form.C30H44BrN5O5S
Mol. Mass.666.67
SMILESCCSCC(NC(=O)[C@@H](Cc1c(Br)[nH]c2ccccc12)NC(=O)C(CC(C)C)NC(=O)N1[C@@H](C)CCC[C@H]1C)C(O)=O