Reaction Details
TargetAdenosine receptor A2a
LigandBDBM50018905
Substrate/Competitorn/a
Meas. Tech.ChEMBL_30917 (CHEMBL647261)
Ki 18200±n/a nM
Citation van Rhee, AMJiang, JLMelman, NOlah, MEStiles, GLJacobson, KA Interaction of 1,4-dihydropyridine and pyridine derivatives with adenosine receptors: selectivity for A3 receptors. J Med Chem39:2980-9 (1996) 
 
Adenosine receptor A2a
Name:Adenosine receptor A2a
Type:G Protein-Coupled Receptor (GPCR)
Mol. Mass.:45015.65
Organism:Rattus norvegicus (rat)
Description:Rat A2A receptors expressed in CHO cells.
Residue:410
BDBM50018905
NameBDBM50018905
Synonyms:2,6-Dimethyl-4-(3-nitro-phenyl)-1,4-dihydro-pyridine-3,5-dicarboxylic acid diethyl ester diethyl 2,6-dimethyl-4-(3-nitrophenyl)-1,4-dihydro-3,5-pyridinedicarboxylate
TypeSmall organic molecule
Emp. Form.C19H22N2O6
Mol. Mass.374.3878
SMILESCCOC([O-])=C1C(C(C(=[OH+])OCC)=C(C)N=C1C)c1cccc(c1)[N+]([O-])=O