Reaction Details
TargetAdenosine receptor A1
LigandBDBM50052388
Substrate/Competitorn/a
Meas. Tech.ChEMBL_28835 (CHEMBL649101)
Ki 8170±n/a nM
Citation van Rhee, AMJiang, JLMelman, NOlah, MEStiles, GLJacobson, KA Interaction of 1,4-dihydropyridine and pyridine derivatives with adenosine receptors: selectivity for A3 receptors. J Med Chem39:2980-9 (1996) 
 
Adenosine receptor A1
Name:Adenosine receptor A1
Type:Protein
Mol. Mass.:36704.13
Organism:Rattus norvegicus (rat)
Description:n/a
Residue:326
BDBM50052388
NameBDBM50052388
Synonyms:2,6-Dimethyl-4-propyl-1,4-dihydro-pyridine-3,5-dicarboxylic acid 3-ethyl ester 5-methyl ester | CHEMBL100003
TypeSmall organic molecule
Emp. Form.C15H23NO4
Mol. Mass.281.3474
SMILESCCCC1C(C(=O)OC)C(C)=NC(C)=C1C(=O)OCC