Reaction Details
TargetAdenosine receptor A1
LigandBDBM50052390
Substrate/Competitorn/a
Meas. Tech.ChEMBL_28835 (CHEMBL649101)
Ki 7520±n/a nM
Citation van Rhee, AMJiang, JLMelman, NOlah, MEStiles, GLJacobson, KA Interaction of 1,4-dihydropyridine and pyridine derivatives with adenosine receptors: selectivity for A3 receptors. J Med Chem39:2980-9 (1996) 
 
Adenosine receptor A1
Name:Adenosine receptor A1
Type:Protein
Mol. Mass.:36704.13
Organism:Rattus norvegicus (rat)
Description:n/a
Residue:326
BDBM50052390
NameBDBM50052390
Synonyms:4-Ethyl-2,6-dimethyl-1,4-dihydro-pyridine-3,5-dicarboxylic acid 3-ethyl ester 5-methyl ester | CHEMBL99744
TypeSmall organic molecule
Emp. Form.C14H21NO4
Mol. Mass.267.3208
SMILESCCOC(=O)C1=C(C)N=C(C)C(C1CC)C(=O)OC