Reaction Details
TargetAdenosine receptor A2a
LigandBDBM50052380
Substrate/Competitorn/a
Meas. Tech.ChEMBL_30917 (CHEMBL647261)
Ki 35900±n/a nM
Citation van Rhee, AMJiang, JLMelman, NOlah, MEStiles, GLJacobson, KA Interaction of 1,4-dihydropyridine and pyridine derivatives with adenosine receptors: selectivity for A3 receptors. J Med Chem39:2980-9 (1996) 
 
Adenosine receptor A2a
Name:Adenosine receptor A2a
Type:G Protein-Coupled Receptor (GPCR)
Mol. Mass.:45015.65
Organism:Rattus norvegicus (rat)
Description:Rat A2A receptors expressed in CHO cells.
Residue:410
BDBM50052380
NameBDBM50052380
Synonyms:2,4-Dimethyl-6-phenyl-1,4-dihydro-pyridine-3,5-dicarboxylic acid diethyl ester | CHEMBL100071
TypeSmall organic molecule
Emp. Form.C19H23NO4
Mol. Mass.329.3902
SMILESCCOC(=O)C1C(C)C(C(=O)OCC)=C(N=C1C)c1ccccc1