Reaction Details
TargetAdenosine receptor A3
LigandBDBM50052393
Substrate/Competitorn/a
Meas. Tech.ChEMBL_31693 (CHEMBL645775)
Ki 2780±n/a nM
Citation van Rhee, AMJiang, JLMelman, NOlah, MEStiles, GLJacobson, KA Interaction of 1,4-dihydropyridine and pyridine derivatives with adenosine receptors: selectivity for A3 receptors. J Med Chem39:2980-9 (1996) 
 
Adenosine receptor A3
Name:Adenosine receptor A3
Type:G Protein-Coupled Receptor (GPCR)
Mol. Mass.:36197.32
Organism:Homo sapiens (Human)
Description:P0DMS8
Residue:318
BDBM50052393
NameBDBM50052393
Synonyms:2,4,6-Trimethyl-1,4-dihydro-pyridine-3,5-dicarboxylic acid 3-benzyl ester 5-methyl ester | CHEMBL100646
TypeSmall organic molecule
Emp. Form.C18H21NO4
Mol. Mass.315.3636
SMILESCOC(=O)C1C(C)C(C(=O)OCc2ccccc2)=C(C)N=C1C