Reaction Details
TargetAdenosine receptor A1
LigandBDBM50318493
Substrate/Competitorn/a
Meas. Tech.ChEMBL_28835 (CHEMBL649101)
Ki 20100±n/a nM
Citation van Rhee, AMJiang, JLMelman, NOlah, MEStiles, GLJacobson, KA Interaction of 1,4-dihydropyridine and pyridine derivatives with adenosine receptors: selectivity for A3 receptors. J Med Chem39:2980-9 (1996) 
 
Adenosine receptor A1
Name:Adenosine receptor A1
Type:Protein
Mol. Mass.:36704.13
Organism:Rattus norvegicus (rat)
Description:n/a
Residue:326
BDBM50318493
NameBDBM50318493
Synonyms:3-isopropyl 5-(2-methoxyethyl) 2,6-dimethyl-4-(3-nitrophenyl)-1,4-dihydropyridine-3,5-dicarboxylate CHEMBL1428 Nimotop
TypeSmall organic molecule
Emp. Form.C21H26N2O7
Mol. Mass.418.4403
SMILESCOCCOC(=O)C1=C(C)N=C(C)C(C1c1cccc(c1)[N+]([O-])=O)C(=O)OC(C)C