Reaction Details
TargetAdenosine receptor A3
LigandBDBM50052397
Substrate/Competitorn/a
Meas. Tech.ChEMBL_31693 (CHEMBL645775)
Ki 47100±n/a nM
Citation van Rhee, AMJiang, JLMelman, NOlah, MEStiles, GLJacobson, KA Interaction of 1,4-dihydropyridine and pyridine derivatives with adenosine receptors: selectivity for A3 receptors. J Med Chem39:2980-9 (1996) 
 
Adenosine receptor A3
Name:Adenosine receptor A3
Type:G Protein-Coupled Receptor (GPCR)
Mol. Mass.:36197.32
Organism:Homo sapiens (Human)
Description:P0DMS8
Residue:318
BDBM50052397
NameBDBM50052397
Synonyms:2-Butyl-4,6-dimethyl-1,4-dihydro-pyridine-3,5-dicarboxylic acid diethyl ester | CHEMBL103950
TypeSmall organic molecule
Emp. Form.C17H27NO4
Mol. Mass.309.4006
SMILESCCCCC1=C(C(C)C(C(=O)OCC)C(C)=N1)C(=O)OCC