Reaction Details
TargetAdenosine receptor A3
LigandBDBM50018905
Substrate/Competitorn/a
Meas. Tech.ChEMBL_31693 (CHEMBL645775)
Ki 2510±n/a nM
Citation van Rhee, AMJiang, JLMelman, NOlah, MEStiles, GLJacobson, KA Interaction of 1,4-dihydropyridine and pyridine derivatives with adenosine receptors: selectivity for A3 receptors. J Med Chem39:2980-9 (1996) 
 
Adenosine receptor A3
Name:Adenosine receptor A3
Type:G Protein-Coupled Receptor (GPCR)
Mol. Mass.:36197.32
Organism:Homo sapiens (Human)
Description:P0DMS8
Residue:318
BDBM50018905
NameBDBM50018905
Synonyms:2,6-Dimethyl-4-(3-nitro-phenyl)-1,4-dihydro-pyridine-3,5-dicarboxylic acid diethyl ester diethyl 2,6-dimethyl-4-(3-nitrophenyl)-1,4-dihydro-3,5-pyridinedicarboxylate
TypeSmall organic molecule
Emp. Form.C19H22N2O6
Mol. Mass.374.3878
SMILESCCOC([O-])=C1C(C(C(=[OH+])OCC)=C(C)N=C1C)c1cccc(c1)[N+]([O-])=O