Reaction Details
TargetProthrombin
LigandBDBM50228863
Substrate/Competitorn/a
Meas. Tech.ChEMBL_208545 (CHEMBL879195)
Ki 10±n/a nM
Citation Costanzo, MJMaryanoff, BEHecker, LRSchott, MRYabut, SCZhang, HCAndrade-Gordon, PKauffman, JALewis, JMKrishnan, RTulinsky, A Potent thrombin inhibitors that probe the S1 subsite: tripeptide transition state analogues based on a heterocycle-activated carbonyl group. J Med Chem39:3039-43 (1996) 
 
Prothrombin
Name:Prothrombin
Type:Protein
Mol. Mass.:70029.57
Organism:Homo sapiens (Human)
Description:P00734
Residue:622
BDBM50228863
NameBDBM50228863
Synonyms:(S)-1-((R)-2-Methylamino-3-phenyl-propionyl)-pyrrolidine-2-carboxylic acid ((S)-1-formyl-4-guanidino-butyl)-amide 5N-[4-amino(imino)methylamino-1-formyl-(1S)-butyl]-1-[2-methylamino-3-phenyl-(2R)-propanoyl]-(5S)-dihydro-1H-5-pyrrolecarboxamide Me-(D-Phe)-Pro-Arg-CHO
TypeSmall organic molecule
Emp. Form.C21H32N6O3
Mol. Mass.416.5172
SMILES[#6]-[#7]-[#6@H](-[#6]-c1ccccc1)-[#6](=O)-[#7]-1-[#6]-[#6]-[#6]-[#6@H]-1-[#6](=O)-[#7]-[#6@@H](-[#6]-[#6]-[#6]\[#7]=[#6](\[#7])-[#7])-[#6]=O