Reaction Details
TargetGlutamate carboxypeptidase 2
LigandBDBM50048694
Substrate/Competitorn/a
Meas. Tech.ChEMBL_68365 (CHEMBL677065)
Ki 1.9±n/a nM
Citation Jackson, PFCole, DCSlusher, BSStetz, SLRoss, LEDonzanti, BATrainor, DA Design, synthesis, and biological activity of a potent inhibitor of the neuropeptidase N-acetylated alpha-linked acidic dipeptidase. J Med Chem39:619-22 (1996) 
 
Glutamate carboxypeptidase 2
Name:Glutamate carboxypeptidase 2
Type:PROTEIN
Mol. Mass.:84547.28
Organism:Rattus norvegicus
Description:ChEMBL_68365
Residue:752
BDBM50048694
NameBDBM50048694
Synonyms:2-[(2-Carboxy-ethyl)-hydroxy-phosphinoylmethyl]-pentanedioic acid | CHEMBL156643
TypeSmall organic molecule
Emp. Form.C9H15O8P
Mol. Mass.282.1844
SMILESOC(=O)CCC(CP(O)(=O)CCC(O)=O)C(O)=O