Reaction Details
TargetAdenosine receptor A1
LigandBDBM50454422
Substrate/Competitorn/a
Meas. Tech.ChEMBL_28389 (CHEMBL875517)
EC50>1±n/a nM
Citation Vittori, SCamaioni, EDi Francesco, EVolpini, RMonopoli, ADionisotti, SOngini, ECristalli, G 2-alkenyl and 2-alkyl derivatives of adenosine and adenosine-5'-N-ethyluronamide: different affinity and selectivity of E- and Z-diastereomers at A2A adenosine receptors. J Med Chem39:4211-7 (1996) 
 
Adenosine receptor A1
Name:Adenosine receptor A1
Type:Protein
Mol. Mass.:36704.13
Organism:Rattus norvegicus (rat)
Description:n/a
Residue:326
BDBM50454422
NameBDBM50454422
Synonyms:CHEMBL2113525
TypeSmall organic molecule
Emp. Form.C23H28N6O4
Mol. Mass.452.5062
SMILESCCNC(=O)[C@H]1O[C@H]([C@H](O)[C@@H]1O)n1cnc2c(N)nc(\C=C/CCCc3ccccc3)nc12