Reaction Details
TargetAdenosine receptor A1
LigandBDBM50369167
Substrate/Competitorn/a
Meas. Tech.ChEMBL_28389 (CHEMBL875517)
EC50>1±n/a nM
Citation Vittori, SCamaioni, EDi Francesco, EVolpini, RMonopoli, ADionisotti, SOngini, ECristalli, G 2-alkenyl and 2-alkyl derivatives of adenosine and adenosine-5'-N-ethyluronamide: different affinity and selectivity of E- and Z-diastereomers at A2A adenosine receptors. J Med Chem39:4211-7 (1996) 
 
Adenosine receptor A1
Name:Adenosine receptor A1
Type:Protein
Mol. Mass.:36704.13
Organism:Rattus norvegicus (rat)
Description:n/a
Residue:326
BDBM50369167
NameBDBM50369167
Synonyms:CHEMBL611256
TypeSmall organic molecule
Emp. Form.C18H26N6O4
Mol. Mass.390.4368
SMILESCCCC\C=C/c1nc(N)c2ncn(C3O[C@@H]([C@@H](O)[C@H]3O)C(=O)NCC)c2n1