Reaction Details
TargetAdenosine receptor A2a
LigandBDBM21220
Substrate/Competitorn/a
Meas. Tech.ChEMBL_31064 (CHEMBL641348)
Ki 7.8±n/a nM
Citation Vittori, SCamaioni, EDi Francesco, EVolpini, RMonopoli, ADionisotti, SOngini, ECristalli, G 2-alkenyl and 2-alkyl derivatives of adenosine and adenosine-5'-N-ethyluronamide: different affinity and selectivity of E- and Z-diastereomers at A2A adenosine receptors. J Med Chem39:4211-7 (1996) 
 
Adenosine receptor A2a
Name:Adenosine receptor A2a
Type:G Protein-Coupled Receptor (GPCR)
Mol. Mass.:45015.65
Organism:Rattus norvegicus (rat)
Description:Rat A2A receptors expressed in CHO cells.
Residue:410
BDBM21220
NameBDBM21220
Synonyms:(2S,3S,4R,5R)-5-(6-amino-9H-purin-9-yl)-N-ethyl-3,4-dihydroxyoxolane-2-carboxamide Adenosine, N6-Ethyl-carboxamido CHEMBL464859 NECA
TypeAntineoplastic Agent
Emp. Form.C12H16N6O4
Mol. Mass.308.2932
SMILESCCNC(=O)[C@H]1O[C@H]([C@H](O)[C@@H]1O)n1cnc2c(N)ncnc12