Reaction Details
TargetAdenosine receptor A1
LigandBDBM50369168
Substrate/Competitorn/a
Meas. Tech.ChEMBL_29480 (CHEMBL640473)
Ki>1±n/a nM
Citation Vittori, SCamaioni, EDi Francesco, EVolpini, RMonopoli, ADionisotti, SOngini, ECristalli, G 2-alkenyl and 2-alkyl derivatives of adenosine and adenosine-5'-N-ethyluronamide: different affinity and selectivity of E- and Z-diastereomers at A2A adenosine receptors. J Med Chem39:4211-7 (1996) 
 
Adenosine receptor A1
Name:Adenosine receptor A1
Type:Protein
Mol. Mass.:36704.13
Organism:Rattus norvegicus (rat)
Description:n/a
Residue:326
BDBM50369168
NameBDBM50369168
Synonyms:CHEMBL608918
TypeSmall organic molecule
Emp. Form.C16H25N5O4
Mol. Mass.351.4008
SMILESCCCCCCc1nc(N)c2ncn(C3O[C@H](CO)[C@@H](O)[C@H]3O)c2n1