Reaction Details
TargetD(2) dopamine receptor
LigandBDBM50054069
Substrate/Competitorn/a
Meas. Tech.ChEMBL_61649 (CHEMBL670173)
Ki 2.5±n/a nM
Citation van Vliet, LATepper, PGDijkstra, DDamsma, GWikström, HPugsley, TAAkunne, HCHeffner, TGGlase, SAWise, LD Affinity for dopamine D2, D3, and D4 receptors of 2-aminotetralins. Relevance of D2 agonist binding for determination of receptor subtype selectivity. J Med Chem39:4233-7 (1996) 
 
D(2) dopamine receptor
Name:D(2) dopamine receptor
Type:Cell-surface receptors
Mol. Mass.:50647.10
Organism:Homo sapiens (Human)
Description:P14416
Residue:443
BDBM50054069
NameBDBM50054069
Synonyms:7-(Ethyl-methyl-amino)-5,6,7,8-tetrahydro-naphthalen-2-ol | CHEMBL134571
TypeSmall organic molecule
Emp. Form.C13H19NO
Mol. Mass.205.2961
SMILESCCN(C)C1CCc2ccc(O)cc2C1