Reaction Details
TargetD(2) dopamine receptor
LigandBDBM50054091
Substrate/Competitorn/a
Meas. Tech.ChEMBL_62239 (CHEMBL671571)
Ki 0.84±n/a nM
Citation Claudi, FCingolani, GMDi Stefano, AGiorgioni, GAmenta, FBarili, PFerrari, FGiuliani, D Synthesis, resolution, and preliminary evaluation of trans-2-amino-6(5)-hydroxy-1-phenyl-2,3-dihydro-1H-indenes and related derivatives as dopamine receptors ligands. J Med Chem39:4238-46 (1996) 
 
D(2) dopamine receptor
Name:D(2) dopamine receptor
Type:G Protein-Coupled Receptor (GPCR)
Mol. Mass.:50931.60
Organism:Rattus norvegicus (rat)
Description:P61169
Residue:444
BDBM50054091
NameBDBM50054091
Synonyms:(2R,3R)-2-Dipropylamino-3-phenyl-indan-5-ol | CHEMBL335515
TypeSmall organic molecule
Emp. Form.C21H27NO
Mol. Mass.309.4452
SMILESCCCN(CCC)[C@@H]1Cc2ccc(O)cc2[C@H]1c1ccccc1