Reaction Details
TargetD(2) dopamine receptor
LigandBDBM82247
Substrate/Competitorn/a
Meas. Tech.ChEMBL_62239 (CHEMBL671571)
Ki>1000±n/a nM
Citation Claudi, FCingolani, GMDi Stefano, AGiorgioni, GAmenta, FBarili, PFerrari, FGiuliani, D Synthesis, resolution, and preliminary evaluation of trans-2-amino-6(5)-hydroxy-1-phenyl-2,3-dihydro-1H-indenes and related derivatives as dopamine receptors ligands. J Med Chem39:4238-46 (1996) 
 
D(2) dopamine receptor
Name:D(2) dopamine receptor
Type:G Protein-Coupled Receptor (GPCR)
Mol. Mass.:50931.60
Organism:Rattus norvegicus (rat)
Description:P61169
Residue:444
BDBM82247
NameBDBM82247
Synonyms:8-Chloro-3-methyl-5-phenyl-2,3,4,5-tetrahydro-1H-benzo[d]azepin-7-ol(SCH 23390) CHEMBL2158641 SCH 23388 SCH 23390 (R-enantiomer) | SCH 23390,R(+)
TypeSmall organic molecule
Emp. Form.C17H18ClNO
Mol. Mass.287.784
SMILESCN1CCc2cc(Cl)c(O)cc2[C@H](C1)c1ccccc1