Reaction Details
TargetAdenosine receptor A3
LigandBDBM50054669
Substrate/Competitorn/a
Meas. Tech.ChEMBL_31254 (CHEMBL640399)
Ki 1420±n/a nM
Citation Jiang, JLvan Rhee, AMMelman, NJi, XDJacobson, KA 6-phenyl-1,4-dihydropyridine derivatives as potent and selective A3 adenosine receptor antagonists. J Med Chem39:4667-75 (1996) 
 
Adenosine receptor A3
Name:Adenosine receptor A3
Type:G Protein-Coupled Receptor (GPCR)
Mol. Mass.:36197.32
Organism:Homo sapiens (Human)
Description:P0DMS8
Residue:318
BDBM50054669
NameBDBM50054669
Synonyms:4-(2,2-Diphenyl-vinyl)-2-methyl-6-phenyl-1,4-dihydro-pyridine-3,5-dicarboxylic acid diethyl ester | CHEMBL143384
TypeSmall organic molecule
Emp. Form.C32H31NO4
Mol. Mass.493.5928
SMILES[#6]-[#6]-[#8]-[#6](=O)-[#6]-1-[#6](\[#6]=[#6](\c2ccccc2)-c2ccccc2)-[#6](-[#6](=O)-[#8]-[#6]-[#6])=[#6](-[#7]=[#6]-1-[#6])-c1ccccc1