Reaction Details
TargetAdenosine receptor A1
LigandBDBM50034683
Substrate/Competitorn/a
Meas. Tech.ChEMBL_29147 (CHEMBL639427)
Ki>100000±n/a nM
Citation Jiang, JLvan Rhee, AMMelman, NJi, XDJacobson, KA 6-phenyl-1,4-dihydropyridine derivatives as potent and selective A3 adenosine receptor antagonists. J Med Chem39:4667-75 (1996) 
 
Adenosine receptor A1
Name:Adenosine receptor A1
Type:Protein
Mol. Mass.:36704.13
Organism:Rattus norvegicus (rat)
Description:n/a
Residue:326
BDBM50034683
NameBDBM50034683
Synonyms:(S)-2,6-Dimethyl-4-(3-nitro-phenyl)-1,4-dihydro-pyridine-3,5-dicarboxylic acid 3-[3-(4,4-diphenyl-piperidin-1-yl)-propyl] ester 5-methyl ester | CHEMBL41929
TypeSmall organic molecule
Emp. Form.C36H39N3O6
Mol. Mass.609.7114
SMILESCOC(=[OH+])C1=C(C)N=C(C)C([C@H]1c1cccc(c1)[N+]([O-])=O)=C([O-])OCCCN1CCC(CC1)(c1ccccc1)c1ccccc1