Reaction Details
TargetAdenosine receptor A3
LigandBDBM50054677
Substrate/Competitorn/a
Meas. Tech.ChEMBL_31859 (CHEMBL643936)
Ki 2750±n/a nM
Citation Jiang, JLvan Rhee, AMMelman, NJi, XDJacobson, KA 6-phenyl-1,4-dihydropyridine derivatives as potent and selective A3 adenosine receptor antagonists. J Med Chem39:4667-75 (1996) 
 
Adenosine receptor A3
Name:Adenosine receptor A3
Type:G Protein-Coupled Receptor (GPCR)
Mol. Mass.:36197.32
Organism:Homo sapiens (Human)
Description:P0DMS8
Residue:318
BDBM50054677
NameBDBM50054677
Synonyms:2-Methyl-6-phenyl-4-phenylethynyl-pyridine-3,5-dicarboxylic acid 5-benzyl ester 3-ethyl ester | CHEMBL108797
TypeSmall organic molecule
Emp. Form.C31H25NO4
Mol. Mass.475.5345
SMILESCCOC(=O)c1c(C)nc(-c2ccccc2)c(C(=O)OCc2ccccc2)c1C#Cc1ccccc1