Reaction Details
TargetAdenosine receptor A3
LigandBDBM50054686
Substrate/Competitorn/a
Meas. Tech.ChEMBL_31859 (CHEMBL643936)
Ki 1430±n/a nM
Citation Jiang, JLvan Rhee, AMMelman, NJi, XDJacobson, KA 6-phenyl-1,4-dihydropyridine derivatives as potent and selective A3 adenosine receptor antagonists. J Med Chem39:4667-75 (1996) 
 
Adenosine receptor A3
Name:Adenosine receptor A3
Type:G Protein-Coupled Receptor (GPCR)
Mol. Mass.:36197.32
Organism:Homo sapiens (Human)
Description:P0DMS8
Residue:318
BDBM50054686
NameBDBM50054686
Synonyms:2-(4-Methoxy-phenyl)-6-methyl-4-((E)-styryl)-1,4-dihydro-pyridine-3,5-dicarboxylic acid diethyl ester | CHEMBL142262
TypeSmall organic molecule
Emp. Form.C27H29NO5
Mol. Mass.447.5229
SMILESCCOC(=O)C1C(\C=C\c2ccccc2)C(C(=O)OCC)=C(N=C1C)c1ccc(OC)cc1