Reaction Details
TargetGlucocorticoid receptor
LigandBDBM50054951
Substrate/Competitorn/a
Meas. Tech.ChEMBL_71419 (CHEMBL685137)
IC50 22±n/a nM
Citation Ashton, MJLawrence, CKarlsson, JAStuttle, KANewton, CGVacher, BYWebber, SWithnall, MJ Anti-inflammatory 17beta-thioalkyl-16alpha,17alpha-ketal and -acetal androstanes: a new class of airway selective steroids for the treatment of asthma. J Med Chem39:4888-96 (1997) 
 
Glucocorticoid receptor
Name:Glucocorticoid receptor
Type:Enzyme Catalytic Domain
Mol. Mass.:87556.83
Organism:RAT
Description:Glucocorticoid 0 RAT::P06536
Residue:795
BDBM50054951
NameBDBM50054951
Synonyms:(4aS,4bR,5S,6aS,6bR,9aR)-4b-Fluoro-5-hydroxy-4a,6a,8,8-tetramethyl-6b-(pyridin-2-ylsulfanyl)-4a,4b,5,6,6a,6b,9a,10,10a,10b,11,12-dodecahydro-7,9-dioxa-pentaleno[2,1-a]phenanthren-2-one | CHEMBL435878
TypeSmall organic molecule
Emp. Form.C27H32FNO4S
Mol. Mass.485.611
SMILESCC1(C)O[C@@H]2CC3C4CCC5=CC(=O)C=C[C@]5(C)[C@@]4(F)[C@@H](O)C[C@]3(C)[C@@]2(O1)Sc1ccccn1