Reaction Details
TargetType-1 angiotensin II receptor
LigandBDBM50041969
Substrate/Competitorn/a
Meas. Tech.ChEMBL_34649 (CHEMBL649708)
IC50 0.100000±n/a nM
Citation Wexler, RRGreenlee, WJIrvin, JDGoldberg, MRPrendergast, KSmith, RDTimmermans, PB Nonpeptide angiotensin II receptor antagonists: the next generation in antihypertensive therapy. J Med Chem39:625-56 (1996) 
 
Type-1 angiotensin II receptor
Name:Type-1 angiotensin II receptor
Type:Enzyme Catalytic Domain
Mol. Mass.:41009.15
Organism:RABBIT
Description:ANGIOTENSIN AT1 AGTR1 RABBIT::P34976
Residue:359
BDBM50041969
NameBDBM50041969
Synonyms:3-{2-Butyl-4-oxo-3-[2'-(1H-tetrazol-5-yl)-biphenyl-4-ylmethyl]-3,4-dihydro-quinazolin-6-yl}-1-isopropyl-1-methyl-urea CHEMBL24322 | L-159093
TypeSmall organic molecule
Emp. Form.C31H34N8O2
Mol. Mass.550.6541
SMILESCCCCc1nc2ccc(NC(=O)N(C)C(C)C)cc2c(=O)n1Cc1ccc(cc1)-c1ccccc1-c1nnn[nH]1