Reaction Details
TargetD(1A) dopamine receptor
LigandBDBM50029050
Substrate/Competitorn/a
Meas. Tech.ChEMBL_59012 (CHEMBL669035)
Kd 55000±n/a nM
Citation Brusniak, MYPearlman, RSNeve, KAWilcox, RE Comparative molecular field analysis-based prediction of drug affinities at recombinant D1A dopamine receptors. J Med Chem39:850-9 (1996) 
 
D(1A) dopamine receptor
Name:D(1A) dopamine receptor
Type:Enzyme
Mol. Mass.:49303.43
Organism:Homo sapiens (Human)
Description:P21728
Residue:446
BDBM50029050
NameBDBM50029050
Synonyms:(-)-(R)-epinephrine (-)-adrenaline (R)-adrenaline Adrenalin EPINEPHRINE levoepinephrine
TypeSmall organic molecule
Emp. Form.C9H13NO3
Mol. Mass.183.2044
SMILESCNC[C@H](O)c1ccc(O)c(O)c1