Reaction Details
TargetD(2) dopamine receptor
LigandBDBM50051255
Substrate/Competitorn/a
Meas. Tech.ChEMBL_61578 (CHEMBL675092)
IC50 4.7±n/a nM
Citation Norman, MHRigdon, GCHall, WRNavas, F Structure-activity relationships of a series of substituted benzamides: potent D2/5-HT2 antagonists and 5-HT1a agonists as neuroleptic agents. J Med Chem39:1172-88 (1996) 
 
D(2) dopamine receptor
Name:D(2) dopamine receptor
Type:G Protein-Coupled Receptor (GPCR)
Mol. Mass.:50931.60
Organism:Rattus norvegicus (rat)
Description:P61169
Residue:444
BDBM50051255
NameBDBM50051255
Synonyms:CHEMBL539740 | N-[4-(4-Benzo[d]isothiazol-3-yl-piperazin-1-yl)-butyl]-2-methylamino-benzamide; hydrochloride
TypeSmall organic molecule
Emp. Form.C23H29N5OS
Mol. Mass.423.574
SMILESCNc1ccccc1C(=O)NCCCCN1CCN(CC1)c1nsc2ccccc12