Reaction Details
Target5-hydroxytryptamine receptor 1A
LigandBDBM85048
Substrate/Competitorn/a
Meas. Tech.ChEMBL_862 (CHEMBL615918)
IC50 3.8±n/a nM
Citation Norman, MHRigdon, GCHall, WRNavas, F Structure-activity relationships of a series of substituted benzamides: potent D2/5-HT2 antagonists and 5-HT1a agonists as neuroleptic agents. J Med Chem39:1172-88 (1996) 
 
5-hydroxytryptamine receptor 1A
Name:5-hydroxytryptamine receptor 1A
Type:G Protein-Coupled Receptor (GPCR)
Mol. Mass.:46445.29
Organism:Rattus norvegicus (rat)
Description:Binding assays were performed using rat hippocampal membranes.
Residue:422
BDBM85048
NameBDBM85048
Synonyms:CHEMBL537481 | Glaxo 1192U90
TypeSmall organic molecule
Emp. Form.C22H27N5OS
Mol. Mass.409.548
SMILESNc1ccccc1C(=O)NCCCCN1CCN(CC1)c1nsc2ccccc12