Reaction Details
Target5-hydroxytryptamine receptor 1A
LigandBDBM50051285
Substrate/Competitorn/a
Meas. Tech.ChEMBL_862 (CHEMBL615918)
IC50 0.70±n/a nM
Citation Norman, MHRigdon, GCHall, WRNavas, F Structure-activity relationships of a series of substituted benzamides: potent D2/5-HT2 antagonists and 5-HT1a agonists as neuroleptic agents. J Med Chem39:1172-88 (1996) 
 
5-hydroxytryptamine receptor 1A
Name:5-hydroxytryptamine receptor 1A
Type:G Protein-Coupled Receptor (GPCR)
Mol. Mass.:46445.29
Organism:Rattus norvegicus (rat)
Description:Binding assays were performed using rat hippocampal membranes.
Residue:422
BDBM50051285
NameBDBM50051285
Synonyms:CHEMBL542554 | {4-[4-(4-Benzo[d]isothiazol-3-yl-piperazin-1-yl)-butylcarbamoyl]-phenyl}-carbamic acid tert-butyl ester; hydrochloride
TypeSmall organic molecule
Emp. Form.C27H35N5O3S
Mol. Mass.509.664
SMILESCC(C)(C)OC(=O)Nc1ccc(cc1)C(=O)NCCCCN1CCN(CC1)c1nsc2ccccc12