Reaction Details
TargetD(2) dopamine receptor
LigandBDBM50051265
Substrate/Competitorn/a
Meas. Tech.ChEMBL_61578 (CHEMBL675092)
IC50 3±n/a nM
Citation Norman, MHRigdon, GCHall, WRNavas, F Structure-activity relationships of a series of substituted benzamides: potent D2/5-HT2 antagonists and 5-HT1a agonists as neuroleptic agents. J Med Chem39:1172-88 (1996) 
 
D(2) dopamine receptor
Name:D(2) dopamine receptor
Type:G Protein-Coupled Receptor (GPCR)
Mol. Mass.:50931.60
Organism:Rattus norvegicus (rat)
Description:P61169
Residue:444
BDBM50051265
NameBDBM50051265
Synonyms:2-Amino-N-[4-(4-benzo[d]isothiazol-3-yl-piperazin-1-yl)-butyl]-5-fluoro-benzamide; hydrochloride | CHEMBL542059
TypeSmall organic molecule
Emp. Form.C22H26FN5OS
Mol. Mass.427.538
SMILESNc1ccc(F)cc1C(=O)NCCCCN1CCN(CC1)c1nsc2ccccc12