Reaction Details
TargetProgesterone receptor
LigandBDBM50408093
Substrate/Competitorn/a
Meas. Tech.ChEMBL_159861 (CHEMBL764070)
IC50 260±n/a nM
Citation Hamann, LGFarmer, LJJohnson, MGBender, SLMais, DEWang, MWCrombie, DGoldman, MEJones, TK Synthesis and biological activity of novel nonsteroidal progesterone receptor antagonists based on cyclocymopol monomethyl ether. J Med Chem39:1778-89 (1996) 
 
Progesterone receptor
Name:Progesterone receptor
Type:Protein
Mol. Mass.:98979.52
Organism:Homo sapiens (Human)
Description:P06401
Residue:933
BDBM50408093
NameBDBM50408093
Synonyms:CHEMBL2113712
TypeSmall organic molecule
Emp. Form.C17H21NO3
Mol. Mass.287.3535
SMILESCC1=CC(=C)C(O)(Cc2ccc(cc2)[N+]([O-])=O)C(C)(C)C1